Target
Dual specificity mitogen-activated protein kinase kinase 3
Ligand
BDBM50097398
Substrate
Meas. Tech.
ChEMBL_1544299 (CHEMBL3751416)
Kd
2000±n/a nM
Citation
 Adams, MKobayashi, TLawson, JDSaitoh, MShimokawa, KBigi, SVHixon, MSSmith, CRTatamiya, TGoto, MRusso, JGrimshaw, CESwann, S Fragment-based drug discovery of potent and selective MKK3/6 inhibitors. Bioorg Med Chem Lett 26:1086-9 (2016)  
Target
Name:
Dual specificity mitogen-activated protein kinase kinase 3
Synonyms:
Dual specificity mitogen-activated protein kinase kinase 3 MAP2K3 MAPK/ERK kinase 3 (MEK3) MEK3 MP2K3_HUMAN SKK2
Type:
Protein
Mol. Mass.:
39321.50
Organism:
Homo sapiens (Human)
Description:
Residue:
347
  
Inhibitor
Name:
BDBM50097398
Synonyms:
CHEMBL449216 | HTS-9026
Type:
Small organic molecule
Emp. Form.:
C9H8N4O
Mol. Mass.:
188.186
SMILES:
NC(=O)c1nnc2ccccc2c1N
: