Target
Bromodomain adjacent to zinc finger domain protein 2B
Ligand
BDBM50148290
Substrate
Meas. Tech.
ChEMBL_1557667 (CHEMBL3772736)
IC50
840±n/a nM
Citation
 Chen, PChaikuad, ABamborough, PBantscheff, MBountra, CChung, CWFedorov, OGrandi, PJung, DLesniak, RLindon, MMüller, SPhilpott, MPrinjha, RRogers, CSelenski, CTallant, CWerner, TWillson, TMKnapp, SDrewry, DH Discovery and Characterization of GSK2801, a Selective Chemical Probe for the Bromodomains BAZ2A and BAZ2B. J Med Chem 59:1410-24 (2016)  
Target
Name:
Bromodomain adjacent to zinc finger domain protein 2B
Synonyms:
BAZ2B KIAA1476 | hWALp4
Type:
PROTEIN
Mol. Mass.:
240455.43
Organism:
Homo sapiens (Human)
Description:
ChEMBL_1498197
Residue:
2168
  
Inhibitor
Name:
BDBM50148290
Synonyms:
CHEMBL3770277
Type:
Small organic molecule
Emp. Form.:
C23H19NO4S
Mol. Mass.:
405.466
SMILES:
CC(=O)c1cc(-c2ccccc2S(C)(=O)=O)c2cc(Oc3ccccc3)ccn12
: