Target
Potassium voltage-gated channel subfamily H member 2
Ligand
BDBM50248106
Substrate
Meas. Tech.
ChEMBL_1558443 (CHEMBL3773319)
IC50
690±n/a nM
Citation
 Zhang, HTong, RBai, LShi, JOuyang, L Emerging targets and new small molecule therapies in Parkinson's disease treatment. Bioorg Med Chem 24:1419-30 (2016)  
Target
Name:
Potassium voltage-gated channel subfamily H member 2
Synonyms:
1,3-beta-glucan synthase component GLS2 ERG Eag-related protein 1 Ether-a-go-go-related gene (HERG) Ether-a-go-go-related gene potassium channel 1 Ether-a-go-go-related gene potassium channel 1 (hERG1) Ether-a-go-go-related protein 1 H-ERG KCNH2 Potassium voltage-gated channel subfamily H member 2 (hERG) Voltage-gated potassium channel subunit Kv11.1 hERG Potassium Channel 1 | putative potassium channel subunit
Type:
Multi-pass membrane protein
Mol. Mass.:
126672.65
Organism:
Homo sapiens (Human)
Description:
Q12809
Residue:
1159
  
Inhibitor
Name:
BDBM50248106
Synonyms:
CHEMBL461101 Eltrombopag olamine
Type:
Small organic molecule
Emp. Form.:
C25H22N4O4
Mol. Mass.:
442.4666
SMILES:
Cc1[nH]n(-c2ccc(C)c(C)c2)c(=O)c1N=Nc1cccc(-c2cccc(c2)C(O)=O)c1O
: