Target
Corticotropin-releasing factor receptor 1
Ligand
BDBM50153488
Substrate
Meas. Tech.
ChEMBL_1560862 (CHEMBL3778934)
Ki
0.790000±n/a nM
Citation
 Erchegyi, JWang, LGulyas, JSamant, MPerrin, MHLewis, KMiller, CVaughan, JDonaldson, CFischer, WLow, WYakabi, SKarasawa, HTaché, YRivier, CRivier, J Characterization of Multisubstituted Corticotropin Releasing Factor (CRF) Peptide Antagonists (Astressins). J Med Chem 59:854-66 (2016)  
Target
Name:
Corticotropin-releasing factor receptor 1
Synonyms:
CRF-R CRF1 CRFR1 CRH-R 1 CRHR1 Corticotropin-releasing factor receptor 1 (CRF-1) Corticotropin-releasing hormone receptor 1
Type:
Enzyme
Mol. Mass.:
50744.31
Organism:
Homo sapiens (Human)
Description:
P34998
Residue:
444
  
Inhibitor
Name:
BDBM50153488
Synonyms:
CHEMBL3775288
Type:
Small organic molecule
Emp. Form.:
C183H294N50O49
Mol. Mass.:
3978.5981
SMILES:
CCCCC(NC(=O)C(CCC(O)=O)NC(=O)C(CC(C)C)NC(=O)C(NC(=O)C(CCC(O)=O)NC(=O)C(CCCNC(N)=N)NC(=O)C(CC(C)C)NC(=O)C(CC(C)C)NC(=O)C(Cc1cnc[nH]1)NC(=O)C(Cc1ccccc1)NC(=O)C(NC(=O)C(CC(C)C)NC(=O)C(CC(O)=O)NC(C)=O)C(C)O)C(C)C)C(=O)NC(C)C(=O)NC(CCCNC(N)=N)C(=O)NC(C)C(=O)NC(CCC(O)=O)C(=O)NC(CCC(N)=O)C(=O)NC(C)(Cc1ccccc1)C(=O)NC(C)C(=O)NC(CCC(N)=O)C(=O)NC1CCC(=O)NCCCCC(NC(=O)C(C)(C)NC(=O)C(C)NC1=O)C(=O)NC(CC(N)=O)C(=O)NC(CCCNC(N)=N)C(=O)NC(CCCCN)C(=O)NC(CC(C)C)C(=O)NC(CCCC)C(=O)NC(CCC(O)=O)C(=O)NC(C)(Cc1ccccc1)C(=O)NC(C(C)CC)C(N)=O
: