Target
Corticotropin-releasing factor receptor 2
Ligand
BDBM50153473
Substrate
Meas. Tech.
ChEMBL_1560863 (CHEMBL3778935)
Ki
0.940000±n/a nM
Citation
 Erchegyi, JWang, LGulyas, JSamant, MPerrin, MHLewis, KMiller, CVaughan, JDonaldson, CFischer, WLow, WYakabi, SKarasawa, HTaché, YRivier, CRivier, J Characterization of Multisubstituted Corticotropin Releasing Factor (CRF) Peptide Antagonists (Astressins). J Med Chem 59:854-66 (2016)  
Target
Name:
Corticotropin-releasing factor receptor 2
Synonyms:
CRF-R-2 CRF-RB CRFR2_MOUSE CRH-R2 Corticotropin-releasing factor receptor 2 Crf2r | Crhr2
Type:
PROTEIN
Mol. Mass.:
47628.12
Organism:
Mus musculus
Description:
ChEMBL_51276
Residue:
411
  
Inhibitor
Name:
BDBM50153473
Synonyms:
CHEMBL3775796
Type:
Small organic molecule
Emp. Form.:
C179H298N52O49
Mol. Mass.:
3962.6004
SMILES:
CCCCC(NC(=O)[C@H](CCC(O)=O)NC(=O)[C@H](CC(C)C)NC(=O)[C@@H](NC(=O)[C@H](CCC(O)=O)NC(=O)[C@H](CCCNC(N)=N)NC(=O)[C@H](CC(C)C)NC(=O)[C@H](CC(C)C)NC(=O)[C@H](Cc1cnc[nH]1)NC(=O)[C@@H](Cc1ccccc1)NC(=O)[C@@H](NC(=O)[C@H](CC(C)C)NC(=O)[C@H](CC(O)=O)NC(C)=O)[C@@H](C)O)C(C)C)C(=O)N[C@@H](C)C(=O)N[C@@H](CCCNC(N)=N)C(=O)N[C@@H](C)C(=O)N[C@@H](CCC(O)=O)C(=O)N[C@@H](CCC(N)=O)C(=O)NC(C)(CC(C)C)C(=O)N[C@@H](C)C(=O)N[C@@H](CCC(N)=O)C(=O)N[C@H]1CCC(=O)NCCCC[C@H](NC(=O)[C@H](Cc2cnc[nH]2)NC(=O)[C@H](C)NC1=O)C(=O)N[C@@H](CC(N)=O)C(=O)N[C@@H](CCCNC(N)=N)C(=O)N[C@@H](CCCCN)C(=O)N[C@@H](CC(C)C)C(=O)NC(CCCC)C(=O)N[C@@H](CCC(O)=O)C(=O)NC(C)(CC(C)C)C(=O)N[C@@H]([C@@H](C)CC)C(N)=O
: