Target
Somatostatin receptor type 3
Ligand
BDBM50154510
Substrate
Meas. Tech.
ChEMBL_1560970 (CHEMBL3779603)
IC50
74±n/a nM
Citation
 He, SDobbelaar, PHGuo, LYe, ZLiu, JJian, TTruong, QShah, SKDu, WQi, HBakshi, RKHong, QDellureficio, JDSherer, EPasternak, AFeng, ZReibarkh, MLin, MSamuel, KReddy, VBMitelman, STong, SXChicchi, GGTsao, KLTrusca, DWu, MShao, QTrujillo, MEFernandez, GNelson, DBunting, PKerr, JFitzgerald, PMorissette, PVolksdorf, SEiermann, GJLi, CZhang, BBHoward, ADZhou, YPNargund, RPHagmann, WK SAR exploration at the C-3 position of tetrahydro-ß-carboline sstr3 antagonists. Bioorg Med Chem Lett 26:1529-35 (2016)  
Target
Name:
Somatostatin receptor type 3
Synonyms:
SOMATOSTATIN SST3 SS3-R SSR-28 SSTR3 | Somatostatin receptor type 3 (SSTR3)
Type:
Protein
Mol. Mass.:
45855.97
Organism:
Homo sapiens (Human)
Description:
P32745
Residue:
418
  
Inhibitor
Name:
BDBM50154510
Synonyms:
CHEMBL3774909
Type:
Small organic molecule
Emp. Form.:
C24H24ClN5O
Mol. Mass.:
433.933
SMILES:
Clc1ccc(nc1)-c1c[nH]c(n1)[C@H]1Cc2c([nH]c3ccccc23)[C@H](N1)C1CCOCC1
: