Target
Somatostatin receptor type 3
Ligand
BDBM50154520
Substrate
Meas. Tech.
ChEMBL_1560970 (CHEMBL3779603)
IC50
23±n/a nM
Citation
 He, SDobbelaar, PHGuo, LYe, ZLiu, JJian, TTruong, QShah, SKDu, WQi, HBakshi, RKHong, QDellureficio, JDSherer, EPasternak, AFeng, ZReibarkh, MLin, MSamuel, KReddy, VBMitelman, STong, SXChicchi, GGTsao, KLTrusca, DWu, MShao, QTrujillo, MEFernandez, GNelson, DBunting, PKerr, JFitzgerald, PMorissette, PVolksdorf, SEiermann, GJLi, CZhang, BBHoward, ADZhou, YPNargund, RPHagmann, WK SAR exploration at the C-3 position of tetrahydro-ß-carboline sstr3 antagonists. Bioorg Med Chem Lett 26:1529-35 (2016)  
Target
Name:
Somatostatin receptor type 3
Synonyms:
SOMATOSTATIN SST3 SS3-R SSR-28 SSTR3 | Somatostatin receptor type 3 (SSTR3)
Type:
Protein
Mol. Mass.:
45855.97
Organism:
Homo sapiens (Human)
Description:
P32745
Residue:
418
  
Inhibitor
Name:
BDBM50154520
Synonyms:
CHEMBL3775050
Type:
Small organic molecule
Emp. Form.:
C25H24F2N4O
Mol. Mass.:
434.4811
SMILES:
Fc1ccc(-c2c[nH]c(n2)[C@H]2Cc3c([nH]c4ccccc34)[C@H](N2)C2CCOCC2)c(F)c1
: