Target
Somatostatin receptor type 3
Ligand
BDBM50154534
Substrate
Meas. Tech.
ChEMBL_1560970 (CHEMBL3779603)
IC50
25±n/a nM
Citation
 He, SDobbelaar, PHGuo, LYe, ZLiu, JJian, TTruong, QShah, SKDu, WQi, HBakshi, RKHong, QDellureficio, JDSherer, EPasternak, AFeng, ZReibarkh, MLin, MSamuel, KReddy, VBMitelman, STong, SXChicchi, GGTsao, KLTrusca, DWu, MShao, QTrujillo, MEFernandez, GNelson, DBunting, PKerr, JFitzgerald, PMorissette, PVolksdorf, SEiermann, GJLi, CZhang, BBHoward, ADZhou, YPNargund, RPHagmann, WK SAR exploration at the C-3 position of tetrahydro-ß-carboline sstr3 antagonists. Bioorg Med Chem Lett 26:1529-35 (2016)  
Target
Name:
Somatostatin receptor type 3
Synonyms:
SOMATOSTATIN SST3 SS3-R SSR-28 SSTR3 | Somatostatin receptor type 3 (SSTR3)
Type:
Protein
Mol. Mass.:
45855.97
Organism:
Homo sapiens (Human)
Description:
P32745
Residue:
418
  
Inhibitor
Name:
BDBM50154534
Synonyms:
CHEMBL3775851
Type:
Small organic molecule
Emp. Form.:
C29H36N4O
Mol. Mass.:
456.6223
SMILES:
C1CC(CCO1)C1NC(Cc2c1[nH]c1ccccc21)c1nc(c[nH]1)C12CC3CC(CC(C3)C1)C2
: