Target
Sphingosine 1-phosphate receptor 1
Ligand
BDBM50164493
Substrate
Meas. Tech.
ChEMBL_1574131 (CHEMBL3801746)
EC50
1.3±n/a nM
Citation
 Watterson, SHGuo, JSpergel, SHLangevine, CMMoquin, RVShen, DRYarde, MCvijic, MEBanas, DLiu, RSuchard, SJGillooly, KTaylor, TRex-Rabe, SShuster, DJMcIntyre, KWCornelius, GD'Arienzo, CMarino, ABalimane, PWarrack, BSalter-Cid, LMcKinnon, MBarrish, JCCarter, PHPitts, WJXie, JDyckman, AJ Potent and Selective Agonists of Sphingosine 1-Phosphate 1 (S1P1): Discovery and SAR of a Novel Isoxazole Based Series. J Med Chem 59:2820-40 (2016)  
Target
Name:
Sphingosine 1-phosphate receptor 1
Synonyms:
CHEDG1 Endothelial differentiation G-protein coupled receptor 1 S1P1 S1PR1_HUMAN Sphingosine 1-phosphate receptor Edg-1
Type:
Enzyme
Mol. Mass.:
42836.02
Organism:
Homo sapiens (Human)
Description:
P21453
Residue:
382
  
Inhibitor
Name:
BDBM50164493
Synonyms:
CHEMBL3800513
Type:
Small organic molecule
Emp. Form.:
C25H24N4O4
Mol. Mass.:
444.4825
SMILES:
CC(C)c1c(noc1-c1ccccc1)-c1nc(no1)-c1ccc(CN2CC(C2)C(O)=O)cc1
: