Target
G protein-coupled receptor kinase 5
Ligand
BDBM50173313
Substrate
Meas. Tech.
ChEMBL_1581285 (CHEMBL3811362)
IC50
2200±n/a nM
Citation
 Waldschmidt, HVHoman, KTCruz-Rodríguez, OCato, MCWaninger-Saroni, JLarimore, KMCannavo, ASong, JCheung, JYKirchhoff, PDKoch, WJTesmer, JJLarsen, SD Structure-Based Design, Synthesis, and Biological Evaluation of Highly Selective and Potent G Protein-Coupled Receptor Kinase 2 Inhibitors. J Med Chem 59:3793-807 (2016)  
Target
Name:
G protein-coupled receptor kinase 5
Synonyms:
G protein-coupled receptor kinase GRK5 GRK5 | GRK5_HUMAN
Type:
PROTEIN
Mol. Mass.:
67798.93
Organism:
Homo sapiens (Human)
Description:
ChEMBL_1280627
Residue:
590
  
Inhibitor
Name:
BDBM50173313
Synonyms:
CHEMBL1738878
Type:
Small organic molecule
Emp. Form.:
C24H23F2N7O
Mol. Mass.:
463.4825
SMILES:
CCCn1c(CNc2cccc(c2)C(=O)NCc2c(F)cccc2F)nnc1-c1ccncn1
: