Target
G protein-coupled receptor kinase 5
Ligand
BDBM50173321
Substrate
Meas. Tech.
ChEMBL_1581285 (CHEMBL3811362)
IC50
>100000±n/a nM
Citation
 Waldschmidt, HVHoman, KTCruz-Rodríguez, OCato, MCWaninger-Saroni, JLarimore, KMCannavo, ASong, JCheung, JYKirchhoff, PDKoch, WJTesmer, JJLarsen, SD Structure-Based Design, Synthesis, and Biological Evaluation of Highly Selective and Potent G Protein-Coupled Receptor Kinase 2 Inhibitors. J Med Chem 59:3793-807 (2016)  
Target
Name:
G protein-coupled receptor kinase 5
Synonyms:
G protein-coupled receptor kinase GRK5 GRK5 | GRK5_HUMAN
Type:
PROTEIN
Mol. Mass.:
67798.93
Organism:
Homo sapiens (Human)
Description:
ChEMBL_1280627
Residue:
590
  
Inhibitor
Name:
BDBM50173321
Synonyms:
CHEMBL3810383
Type:
Small organic molecule
Emp. Form.:
C26H22FN5O5
Mol. Mass.:
503.4818
SMILES:
CC1=C(C(NC(=O)N1)c1ccc(F)c(c1)C(=O)NCc1ccccn1)C(=O)Nc1ccc2OCOc2c1
: