Target
Rho-associated protein kinase 1
Ligand
BDBM50173326
Substrate
Meas. Tech.
ChEMBL_1581288 (CHEMBL3811365)
IC50
400±n/a nM
Citation
 Waldschmidt, HVHoman, KTCruz-Rodríguez, OCato, MCWaninger-Saroni, JLarimore, KMCannavo, ASong, JCheung, JYKirchhoff, PDKoch, WJTesmer, JJLarsen, SD Structure-Based Design, Synthesis, and Biological Evaluation of Highly Selective and Potent G Protein-Coupled Receptor Kinase 2 Inhibitors. J Med Chem 59:3793-807 (2016)  
Target
Name:
Rho-associated protein kinase 1
Synonyms:
ROCK-I ROCK1_HUMAN Rho-associated protein kinase Rho-associated, coiled-coil-containing protein kinase 1 Rho-kinase (ROCK I) p160 ROCK-1 | p160ROCK
Type:
Serine/threonine-protein kinase
Mol. Mass.:
158156.77
Organism:
Homo sapiens (Human)
Description:
Q13464
Residue:
1354
  
Inhibitor
Name:
BDBM50173326
Synonyms:
CHEMBL3809604 | US10023564, Example 29
Type:
Small organic molecule
Emp. Form.:
C30H23F7N6O3
Mol. Mass.:
648.5308
SMILES:
CC1=C(C(NC(=O)N1)c1ccc(F)c(CC(=O)NCc2c(cccc2C(F)(F)F)C(F)(F)F)c1)C(=O)Nc1ccc2[nH]ncc2c1
: