Target
Neuromedin-K receptor
Ligand
BDBM50180169
Substrate
Meas. Tech.
ChEMBL_1583336 (CHEMBL3816399)
IC50
5.6±n/a nM
Citation
 Yamamoto, KOkazaki, SOhno, HMatsuda, FOhkura, SMaeda, KFujii, NOishi, S Development of novel NK3 receptor antagonists with reduced environmental impact. Bioorg Med Chem 24:3494-500 (2016)  
Target
Name:
Neuromedin-K receptor
Synonyms:
NK-3 receptor NK3R NKR Neurokinin B receptor Neuromedin-3 receptor (NK-3R) Neuromedin-K receptor Neuromedin-K receptor (NK3) TAC3R Tachykinin receptor 3 | Tachykinin receptor 3 (NK3)
Type:
Enzyme
Mol. Mass.:
52221.96
Organism:
Homo sapiens (Human)
Description:
P29371
Residue:
465
  
Inhibitor
Name:
BDBM50180169
Synonyms:
CHEMBL3814787
Type:
Small organic molecule
Emp. Form.:
C25H22N2OS
Mol. Mass.:
398.52
SMILES:
CC[C@H](NC(=O)c1c(S)c(nc2ccccc12)-c1ccccc1)c1ccccc1
: