Target
Sigma non-opioid intracellular receptor 1
Ligand
BDBM50190117
Substrate
Meas. Tech.
ChEBML_1591351
Ki
673±n/a nM
Citation
 Knappmann, ISchepmann, DWünsch, B Oxa-Pictet-Spengler reaction as key step in the synthesis of novels receptor ligands with 2-benzopyran structure. Bioorg Med Chem 24:4045-4055 (2016)  
Target
Name:
Sigma non-opioid intracellular receptor 1
Synonyms:
OPRS1 SIGMAR1 Sigma non-opioid intracellular receptor 1 Sigma1-receptor Sterol isomerase-like protein
Type:
Protein
Mol. Mass.:
25307.17
Organism:
Cavia porcellus (Guinea pig)
Description:
Q60492
Residue:
223
  
Inhibitor
Name:
BDBM50190117
Synonyms:
CHEMBL3827274
Type:
Small organic molecule
Emp. Form.:
C24H29NO3
Mol. Mass.:
379.492
SMILES:
COC(=O)C[C@@H]1Cc2ccccc2[C@H](CN2CCC(CC2)c2ccccc2)O1
: