Target
Estrogen receptor
Ligand
BDBM50193252
Substrate
Meas. Tech.
ChEMBL_1615022 (CHEMBL3857091)
IC50
875±n/a nM
Citation
 Kim, JChin, JIm, CYYoo, EKWoo, SHwang, HJCho, JHSeo, KASong, JHwang, HKim, KHKim, NDYoon, SKJeon, JHYoon, SYJeon, YHChoi, HSLee, IKKim, SHCho, SJ Synthesis and biological evaluation of novel 4-hydroxytamoxifen analogs as estrogen-related receptor gamma inverse agonists. Eur J Med Chem 120:338-52 (2016)  
Target
Name:
Estrogen receptor
Synonyms:
ER ESR ESR1_HUMAN Estrogen receptor Estrogen receptor (ER-alpha) Estrogen receptor alpha (ER) Nuclear receptor subfamily 3 group A member 1
Type:
Protein
Mol. Mass.:
66230.44
Organism:
Homo sapiens (Human)
Description:
P03372
Residue:
595
  
Inhibitor
Name:
BDBM50193252
Synonyms:
CHEMBL3957546
Type:
Small organic molecule
Emp. Form.:
C29H36ClNO3
Mol. Mass.:
482.054
SMILES:
Cl.CCN(CC)CCOc1ccc(cc1)C(=C(\CCCO)c1ccccc1)\c1ccc(O)cc1
: