Target
Bromodomain-containing protein 4
Ligand
BDBM50399434
Substrate
Meas. Tech.
ChEBML_1615800
IC50
3540±n/a nM
Citation
 Li, JWang, PZhou, BShi, JLiu, JLi, XFan, LZheng, YOuyang, L Development of 4,5-dihydro-benzodiazepinone derivatives as a new chemical series of BRD4 inhibitors. Eur J Med Chem 121:294-299 (2016)  
Target
Name:
Bromodomain-containing protein 4
Synonyms:
BRD4 Bromodomain-containing protein 4 (BRD4) Protein HUNK1
Type:
Protein
Mol. Mass.:
152264.84
Organism:
Homo sapiens (Human)
Description:
O60885
Residue:
1362
  
Inhibitor
Name:
BDBM50399434
Synonyms:
CHEMBL2179387
Type:
Small organic molecule
Emp. Form.:
C16H17N3O4S
Mol. Mass.:
347.389
SMILES:
COc1ccccc1S(=O)(=O)Nc1ccc2NC(=O)N(C)Cc2c1
: