Target
Renin
Ligand
BDBM50195782
Substrate
Meas. Tech.
ChEMBL_1617920 (CHEMBL3859989)
IC50
0.790000±n/a nM
Citation
 Imaeda, YTokuhara, HFukase, YKanagawa, RKajimoto, YKusumoto, KKondo, MSnell, GBehnke, CAKuroita, T Discovery of TAK-272: A Novel, Potent, and Orally Active Renin Inhibitor. ACS Med Chem Lett 7:933-938 (2016)  
Target
Name:
Renin
Synonyms:
Angiotensinogenase RENI_HUMAN
Type:
Enzyme
Mol. Mass.:
45058.99
Organism:
Homo sapiens (Human)
Description:
Residue:
406
  
Inhibitor
Name:
BDBM50195782
Synonyms:
CHEMBL3958809
Type:
Small organic molecule
Emp. Form.:
C27H46N6O4
Mol. Mass.:
518.6919
SMILES:
COCCCNc1nc(ncc1C(=O)N(CC(C)C)[C@@H]1CNC[C@@H](C1)C(=O)N1CCOCC1)C(C)(C)C
: