Target
Protein-serine O-palmitoleoyltransferase porcupine
Ligand
BDBM50205489
Substrate
Meas. Tech.
ChEMBL_1628389 (CHEMBL3870974)
EC50
1.8±n/a nM
Citation
 You, LZhang, CYarravarapu, NMorlock, LWang, XZhang, LWilliams, NSLum, LChen, C Development of a triazole class of highly potent Porcn inhibitors. Bioorg Med Chem Lett 26:5891-5895 (2016)  
Target
Name:
Protein-serine O-palmitoleoyltransferase porcupine
Synonyms:
PORCN_MOUSE Porcn Probable protein-cysteine N-palmitoyltransferase porcupine mPORC
Type:
PROTEIN
Mol. Mass.:
52528.36
Organism:
Mus musculus
Description:
ChEMBL_941167
Residue:
461
  
Inhibitor
Name:
BDBM50205489
Synonyms:
CHEMBL3943114
Type:
Small organic molecule
Emp. Form.:
C26H20N6O
Mol. Mass.:
432.4766
SMILES:
O=C(Cn1nnc(c1-c1ccccc1)-c1ccncc1)Nc1ccc(cc1)-c1ccccn1
: