Target
Protein-serine O-palmitoleoyltransferase porcupine
Ligand
BDBM50205491
Substrate
Meas. Tech.
ChEMBL_1628389 (CHEMBL3870974)
EC50
0.200000±n/a nM
Citation
 You, LZhang, CYarravarapu, NMorlock, LWang, XZhang, LWilliams, NSLum, LChen, C Development of a triazole class of highly potent Porcn inhibitors. Bioorg Med Chem Lett 26:5891-5895 (2016)  
Target
Name:
Protein-serine O-palmitoleoyltransferase porcupine
Synonyms:
PORCN_MOUSE Porcn Probable protein-cysteine N-palmitoyltransferase porcupine mPORC
Type:
PROTEIN
Mol. Mass.:
52528.36
Organism:
Mus musculus
Description:
ChEMBL_941167
Residue:
461
  
Inhibitor
Name:
BDBM50205491
Synonyms:
CHEMBL3899701
Type:
Small organic molecule
Emp. Form.:
C26H19FN6O
Mol. Mass.:
450.4671
SMILES:
Fc1ccc(cc1)-c1c(nnn1CC(=O)Nc1ccc(cn1)-c1ccccc1)-c1ccncc1
: