Target
Protein-serine O-palmitoleoyltransferase porcupine
Ligand
BDBM50205496
Substrate
Meas. Tech.
ChEMBL_1628389 (CHEMBL3870974)
EC50
0.600000±n/a nM
Citation
 You, LZhang, CYarravarapu, NMorlock, LWang, XZhang, LWilliams, NSLum, LChen, C Development of a triazole class of highly potent Porcn inhibitors. Bioorg Med Chem Lett 26:5891-5895 (2016)  
Target
Name:
Protein-serine O-palmitoleoyltransferase porcupine
Synonyms:
PORCN_MOUSE Porcn Probable protein-cysteine N-palmitoyltransferase porcupine mPORC
Type:
PROTEIN
Mol. Mass.:
52528.36
Organism:
Mus musculus
Description:
ChEMBL_941167
Residue:
461
  
Inhibitor
Name:
BDBM50205496
Synonyms:
CHEMBL3980962
Type:
Small organic molecule
Emp. Form.:
C27H19F3N6O
Mol. Mass.:
500.4746
SMILES:
FC(F)(F)c1cc(ccn1)-c1nnn(CC(=O)Nc2ccc(cn2)-c2ccccc2)c1-c1ccccc1
: