Target
Free fatty acid receptor 1
Ligand
BDBM50392863
Substrate
Meas. Tech.
ChEMBL_1634354 (CHEMBL3877146)
EC50
>10000±n/a nM
Target
Name:
Free fatty acid receptor 1
Synonyms:
FFAR1 G-protein Coupled Receptor 40 | GPR40
Type:
G Protein-Coupled Receptor (GPCR)
Mol. Mass.:
31473.32
Organism:
Homo sapiens (Human)
Description:
O14842
Residue:
300
  
Inhibitor
Name:
BDBM50392863
Synonyms:
CHEMBL2152069
Type:
Small organic molecule
Emp. Form.:
C26H25FO4
Mol. Mass.:
420.4727
SMILES:
COc1ccc(F)c(c1)-c1ccc(COc2cccc(c2)[C@@H](CC(O)=O)C2CC2)cc1
: