Target
cAMP-dependent protein kinase catalytic subunit gamma
Ligand
BDBM50228841
Substrate
Meas. Tech.
ChEMBL_161403 (CHEMBL768312)
IC50
2000±n/a nM
Citation
 Ricouart, AGesquiere, JCTartar, ASergheraert, C Design of potent protein kinase inhibitors using the bisubstrate approach. J Med Chem 34:73-8 (1991)  
Target
Name:
cAMP-dependent protein kinase catalytic subunit gamma
Synonyms:
KAPCG_HUMAN PRKACG cAMP-dependent protein kinase catalytic subunit gamma
Type:
PROTEIN
Mol. Mass.:
40442.03
Organism:
Homo sapiens (Human)
Description:
ChEMBL_104720
Residue:
351
  
Inhibitor
Name:
BDBM50228841
Synonyms:
CHEMBL351282
Type:
Small organic molecule
Emp. Form.:
C15H19N3O4S
Mol. Mass.:
337.394
SMILES:
COC(=O)CCNCCNS(=O)(=O)c1cccc2cnccc12
: