Target
Vascular endothelial growth factor receptor 3
Ligand
BDBM50413752
Substrate
Meas. Tech.
ChEMBL_1649678 (CHEMBL3998812)
IC50
1.1±n/a nM
Citation
 Cho, HSengupta, SJeon, SSHur, WChoi, HGSeo, HSLee, BJKim, JHChung, MJeon, NLKim, NDSim, T Identification of the First Selective Activin Receptor-Like Kinase 1 Inhibitor, a Reversible Version of L-783277. J Med Chem 60:1495-1508 (2017)  
Target
Name:
Vascular endothelial growth factor receptor 3
Synonyms:
FLT-4 Fms-like tyrosine kinase 4 VEGFR-3 VGFR3_HUMAN Vascular endothelial growth factor receptor 3 (VEGFR-3) | Vascular endothelial growth factor receptor 3 (VEGFR3)
Type:
Protein
Mol. Mass.:
152749.58
Organism:
Homo sapiens (Human)
Description:
P35916-2
Residue:
1363
  
Inhibitor
Name:
BDBM50413752
Synonyms:
CHEMBL2012519 | L-783277
Type:
Small organic molecule
Emp. Form.:
C19H24O7
Mol. Mass.:
364.3897
SMILES:
COc1cc(O)c2c(CCCC(=O)C(=O)C(O)CCC[C@H](C)OC2=O)c1
: