Target
Muscarinic acetylcholine receptor M5
Ligand
BDBM50233360
Substrate
Meas. Tech.
ChEMBL_1650752 (CHEMBL3999886)
IC50
1600±n/a nM
Citation
 McGowan, KMNance, KDCho, HPBridges, TMConn, PJJones, CKLindsley, CW Continued optimization of the M Bioorg Med Chem Lett 27:1356-1359 (2017)  
Target
Name:
Muscarinic acetylcholine receptor M5
Synonyms:
ACM5_RAT Chrm-5 Muscarinic acetylcholine receptor | Muscarinic acetylcholine receptor M5
Type:
Enzyme Catalytic Domain
Mol. Mass.:
60161.80
Organism:
RAT
Description:
Cholinergic, muscarinic M5 CHRM5 RAT::P08911
Residue:
531
  
Inhibitor
Name:
BDBM50233360
Synonyms:
CHEMBL4062497
Type:
Small organic molecule
Emp. Form.:
C24H17ClF2N2O2
Mol. Mass.:
438.854
SMILES:
Cc1cc(ccc1Cl)[C@]12N(CCN1C(=O)c1ccccc21)C(=O)c1ccc(F)c(F)c1
: