Target
Indoleamine 2,3-dioxygenase 1
Ligand
BDBM50233424
Substrate
Meas. Tech.
ChEMBL_1650851 (CHEMBL3999985)
IC50
14±n/a nM
Citation
 Yue, EWSparks, RPolam, PModi, DDouty, BWayland, BGlass, BTakvorian, AGlenn, JZhu, WBower, MLiu, XLeffet, LWang, QBowman, KJHansbury, MJWei, MLi, YWynn, RBurn, TCKoblish, HKFridman, JSEmm, TScherle, PAMetcalf, BCombs, AP INCB24360 (Epacadostat), a Highly Potent and Selective Indoleamine-2,3-dioxygenase 1 (IDO1) Inhibitor for Immuno-oncology. ACS Med Chem Lett 8:486-491 (2017)  
Target
Name:
Indoleamine 2,3-dioxygenase 1
Synonyms:
I23O1_HUMAN IDO-1 INDO Indoleamine 2,3-dioxygenase | Indoleamine-pyrrole 2,3-dioxygenase
Type:
Enzyme
Mol. Mass.:
45330.80
Organism:
Homo sapiens (Human)
Description:
P14902
Residue:
403
  
Inhibitor
Name:
BDBM50233424
Synonyms:
CHEMBL4076756
Type:
Small organic molecule
Emp. Form.:
C10H9BrFN5O2
Mol. Mass.:
330.113
SMILES:
CNc1nonc1\C(Nc1ccc(F)c(Br)c1)=N\O
: