Target
Eukaryotic initiation factor 4A-III
Ligand
BDBM50235738
Substrate
Meas. Tech.
ChEMBL_1657827 (CHEMBL4007297)
IC50
40000±n/a nM
Citation
 Ito, MIwatani, MKamada, YSogabe, SNakao, STanaka, TKawamoto, TAparicio, SNakanishi, AImaeda, Y Discovery of selective ATP-competitive eIF4A3 inhibitors. Bioorg Med Chem 25:2200-2209 (2017)  
Target
Name:
Eukaryotic initiation factor 4A-III
Synonyms:
ATP-dependent RNA helicase DDX48 DDX48 EIF4A3 Eukaryotic translation initiation factor 4A isoform 3 KIAA0111 Nuclear matrix protein 265 eIF4A-III | hNMP 265
Type:
Protein
Mol. Mass.:
46871.02
Organism:
Homo sapiens (Human)
Description:
P38919
Residue:
411
  
Inhibitor
Name:
BDBM50235738
Synonyms:
Hippuristanol
Type:
Small organic molecule
Emp. Form.:
C28H46O5
Mol. Mass.:
462.6618
SMILES:
[H][C@]12C[C@@]3([H])[C@]4([H])CC[C@@]5([H])C[C@H](O)CC[C@]5(C)[C@@]4([H])[C@@H](O)C[C@]3(C)[C@@]1([H])[C@@](C)(O)[C@]1(C[C@H](C)C(C)(C)O1)O2
: