Target
Neuromedin-U receptor 2
Ligand
BDBM50238696
Substrate
Meas. Tech.
ChEMBL_1664052 (CHEMBL4013733)
EC50
0.390000±n/a nM
Citation
 Kanematsu-Yamaki, YNishizawa, NKaisho, TNagai, HMochida, TAsakawa, TInooka, HDote, KFujita, HMatsumiya, KHirabayashi, HSakamoto, JOhtaki, TTakekawa, SAsami, T Potent Body Weight-Lowering Effect of a Neuromedin U Receptor 2-selective PEGylated Peptide. J Med Chem 60:6089-6097 (2017)  
Target
Name:
Neuromedin-U receptor 2
Synonyms:
G-protein coupled receptor FM-4 NMU-R2 NMU2R NMUR2_HUMAN TGR1
Type:
PROTEIN
Mol. Mass.:
47710.86
Organism:
Homo sapiens (Human)
Description:
ChEMBL_103075
Residue:
415
  
Inhibitor
Name:
BDBM50238696
Synonyms:
CHEMBL4087867
Type:
Small organic molecule
Emp. Form.:
C56H79N15O12
Mol. Mass.:
1154.3198
SMILES:
CC(C)C[C@H](NC(=O)[C@H](Cc1ccccc1)NC(=O)[C@H](Cc1ccc(O)cc1)NC(=O)CCN)C(=O)N[C@@H](Cc1ccccc1)C(=O)N[C@@H](CCC(N)=O)C(=O)N1CCC[C@H]1C(=O)N[C@@H](CCCNC(N)=N)C(=O)N[C@@H](CC(N)=O)C(N)=O
: