Target
Neuromedin-U receptor 2
Ligand
BDBM50238712
Substrate
Meas. Tech.
ChEMBL_1664054 (CHEMBL4013735)
EC50
0.400000±n/a nM
Citation
 Kanematsu-Yamaki, YNishizawa, NKaisho, TNagai, HMochida, TAsakawa, TInooka, HDote, KFujita, HMatsumiya, KHirabayashi, HSakamoto, JOhtaki, TTakekawa, SAsami, T Potent Body Weight-Lowering Effect of a Neuromedin U Receptor 2-selective PEGylated Peptide. J Med Chem 60:6089-6097 (2017)  
Target
Name:
Neuromedin-U receptor 2
Synonyms:
NMU-R2 Neuromedin-U receptor 2 | Nmur2
Type:
PROTEIN
Mol. Mass.:
44839.20
Organism:
Mus musculus
Description:
ChEMBL_109541
Residue:
395
  
Inhibitor
Name:
BDBM50238712
Synonyms:
CHEMBL4100718
Type:
Small organic molecule
Emp. Form.:
C71H106N18O16
Mol. Mass.:
1467.7123
SMILES:
CC(C)C[C@H](NC(=O)[C@H](Cc1ccc2ccccc2c1)NC(=O)[C@H](Cc1ccc(O)cc1)NC(=O)COCC(=O)NCCCOCCOCCOCCCN)C(=O)N[C@@H](Cc1ccccc1)C(=O)N[C@@H](CCCNC(N)=N)C(=O)N(C)[C@@H](C)C(=O)N[C@@H](CCCNC(N)=N)C(=O)N[C@@H](CC(N)=O)C(N)=O
: