Target
Glutamate receptor 3
Ligand
BDBM50240399
Substrate
Ki
>10000±n/a nM
Comments
PDSP_668
Citation
 Shimamoto, KLebrun, BYasuda-Kamatani, YSakaitani, MShigeri, YYumoto, NNakajima, T DL-threo-beta-benzyloxyaspartate, a potent blocker of excitatory amino acid transporters. Mol Pharmacol 53:195-201 (1998)  
Target
Name:
Glutamate receptor 3
Synonyms:
GRIA3_RAT Glutamate receptor 3 Glutamate-AMPA | Gria3
Type:
Enzyme Catalytic Domain
Mol. Mass.:
100383.57
Organism:
RAT
Description:
Glutamate-AMPA GRIA3 RAT::P19492
Residue:
888
  
Inhibitor
Name:
BDBM50240399
Synonyms:
(2R,3R,4S)-3-(carboxymethyl)-4-isopropylpyrrolidinium-2-carboxylate (2S,3S,4R)-4-isopropyl-3-(2-oxido-2-oxoethyl)pyrrolidinium-2-carboxylate Dihydrokainate | dihydrokainic acid
Type:
Small organic molecule
Emp. Form.:
C10H17NO4
Mol. Mass.:
215.2463
SMILES:
CC(C)[C@H]1CN[C@@H]([C@H]1CC(O)=O)C(O)=O
: