Target
Glutamate receptor 3
Ligand
BDBM85210
Substrate
Ki
>10000±n/a nM
Comments
PDSP_3926
Citation
 Shimamoto, KLebrun, BYasuda-Kamatani, YSakaitani, MShigeri, YYumoto, NNakajima, T DL-threo-beta-benzyloxyaspartate, a potent blocker of excitatory amino acid transporters. Mol Pharmacol 53:195-201 (1998)  
Target
Name:
Glutamate receptor 3
Synonyms:
GRIA3_RAT Glutamate receptor 3 Glutamate-AMPA | Gria3
Type:
Enzyme Catalytic Domain
Mol. Mass.:
100383.57
Organism:
RAT
Description:
Glutamate-AMPA GRIA3 RAT::P19492
Residue:
888
  
Inhibitor
Name:
BDBM85210
Synonyms:
DL-TBzOAsp
Type:
Small organic molecule
Emp. Form.:
C11H11NO6
Mol. Mass.:
253.2081
SMILES:
N[C@@H]([C@H](OC(=O)c1ccccc1)C(O)=O)C(O)=O
: