Target
Glutamate receptor 3
Ligand
BDBM85209
Substrate
Ki
>10000±n/a nM
Comments
PDSP_3927
Citation
 Shimamoto, KLebrun, BYasuda-Kamatani, YSakaitani, MShigeri, YYumoto, NNakajima, T DL-threo-beta-benzyloxyaspartate, a potent blocker of excitatory amino acid transporters. Mol Pharmacol 53:195-201 (1998)  
Target
Name:
Glutamate receptor 3
Synonyms:
GRIA3_RAT Glutamate receptor 3 Glutamate-AMPA | Gria3
Type:
Enzyme Catalytic Domain
Mol. Mass.:
100383.57
Organism:
RAT
Description:
Glutamate-AMPA GRIA3 RAT::P19492
Residue:
888
  
Inhibitor
Name:
BDBM85209
Synonyms:
DL-THA
Type:
Small organic molecule
Emp. Form.:
C4H7NO5
Mol. Mass.:
149.1021
SMILES:
N[C@@H]([C@H](O)C(O)=O)C(O)=O
: