Target
Glutamate receptor ionotropic, kainate 1
Ligand
BDBM50093753
Substrate
Ki
>10000±n/a nM
Comments
PDSP_3925
Citation
 Shimamoto, KLebrun, BYasuda-Kamatani, YSakaitani, MShigeri, YYumoto, NNakajima, T DL-threo-beta-benzyloxyaspartate, a potent blocker of excitatory amino acid transporters. Mol Pharmacol 53:195-201 (1998)  
Target
Name:
Glutamate receptor ionotropic, kainate 1
Synonyms:
GRIK1_RAT Glutamate receptor ionotropic kainate 1 Glutamate receptor, ionotropic kainate 1 Grik1
Type:
Enzyme Catalytic Domain
Mol. Mass.:
107860.82
Organism:
RAT
Description:
P22756
Residue:
949
  
Inhibitor
Name:
BDBM50093753
Synonyms:
(2S,3S)-2-Amino-3-benzyloxy-succinic acid (3S)-3-(BENZYLOXY)-L-ASPARTIC ACID DL-TBOA
Type:
Small organic molecule
Emp. Form.:
C11H13NO5
Mol. Mass.:
239.2246
SMILES:
N[C@@H]([C@H](OCc1ccccc1)C(O)=O)C(O)=O
: