Target
Glutamate receptor ionotropic, kainate 1
Ligand
BDBM85209
Substrate
Ki
>10000±n/a nM
Comments
PDSP_3927
Citation
 Shimamoto, KLebrun, BYasuda-Kamatani, YSakaitani, MShigeri, YYumoto, NNakajima, T DL-threo-beta-benzyloxyaspartate, a potent blocker of excitatory amino acid transporters. Mol Pharmacol 53:195-201 (1998)  
Target
Name:
Glutamate receptor ionotropic, kainate 1
Synonyms:
GRIK1_RAT Glutamate receptor ionotropic kainate 1 Glutamate receptor, ionotropic kainate 1 Grik1
Type:
Enzyme Catalytic Domain
Mol. Mass.:
107860.82
Organism:
RAT
Description:
P22756
Residue:
949
  
Inhibitor
Name:
BDBM85209
Synonyms:
DL-THA
Type:
Small organic molecule
Emp. Form.:
C4H7NO5
Mol. Mass.:
149.1021
SMILES:
N[C@@H]([C@H](O)C(O)=O)C(O)=O
: