Target
Glutamate receptor ionotropic, kainate 1
Ligand
BDBM85211
Substrate
Ki
>10000±n/a nM
Comments
PDSP_3928
Citation
 Shimamoto, KLebrun, BYasuda-Kamatani, YSakaitani, MShigeri, YYumoto, NNakajima, T DL-threo-beta-benzyloxyaspartate, a potent blocker of excitatory amino acid transporters. Mol Pharmacol 53:195-201 (1998)  
Target
Name:
Glutamate receptor ionotropic, kainate 1
Synonyms:
GRIK1_RAT Glutamate receptor ionotropic kainate 1 Glutamate receptor, ionotropic kainate 1 Grik1
Type:
Enzyme Catalytic Domain
Mol. Mass.:
107860.82
Organism:
RAT
Description:
P22756
Residue:
949
  
Inhibitor
Name:
BDBM85211
Synonyms:
t-2,4-PDC | t-PDC
Type:
Small organic molecule
Emp. Form.:
C6H9NO4
Mol. Mass.:
159.14
SMILES:
OC(=O)[C@H]1CN[C@@H](C1)C(O)=O
: