Target
Glutamate receptor ionotropic, NMDA 1
Ligand
BDBM85210
Substrate
Ki
>10000±n/a nM
Comments
PDSP_3926
Citation
 Shimamoto, KLebrun, BYasuda-Kamatani, YSakaitani, MShigeri, YYumoto, NNakajima, T DL-threo-beta-benzyloxyaspartate, a potent blocker of excitatory amino acid transporters. Mol Pharmacol 53:195-201 (1998)  
Target
Name:
Glutamate receptor ionotropic, NMDA 1
Synonyms:
Glutamate (NMDA) receptor subunit zeta 1 Glutamate-NMDA-Channel Glutamate-NMDA-Polyamine NMDA Nmdar1 | phencyclidine
Type:
Enzyme Catalytic Domain
Mol. Mass.:
105533.40
Organism:
RAT
Description:
P35439
Residue:
938
  
Inhibitor
Name:
BDBM85210
Synonyms:
DL-TBzOAsp
Type:
Small organic molecule
Emp. Form.:
C11H11NO6
Mol. Mass.:
253.2081
SMILES:
N[C@@H]([C@H](OC(=O)c1ccccc1)C(O)=O)C(O)=O
: