Target
Glutamate receptor ionotropic, NMDA 1
Ligand
BDBM85209
Substrate
Ki
>10000±n/a nM
Comments
PDSP_3927
Citation
 Shimamoto, KLebrun, BYasuda-Kamatani, YSakaitani, MShigeri, YYumoto, NNakajima, T DL-threo-beta-benzyloxyaspartate, a potent blocker of excitatory amino acid transporters. Mol Pharmacol 53:195-201 (1998)  
Target
Name:
Glutamate receptor ionotropic, NMDA 1
Synonyms:
Glutamate (NMDA) receptor subunit zeta 1 Glutamate-NMDA-Channel Glutamate-NMDA-Polyamine NMDA Nmdar1 | phencyclidine
Type:
Enzyme Catalytic Domain
Mol. Mass.:
105533.40
Organism:
RAT
Description:
P35439
Residue:
938
  
Inhibitor
Name:
BDBM85209
Synonyms:
DL-THA
Type:
Small organic molecule
Emp. Form.:
C4H7NO5
Mol. Mass.:
149.1021
SMILES:
N[C@@H]([C@H](O)C(O)=O)C(O)=O
: