Target
Glutamate receptor ionotropic, NMDA 1
Ligand
BDBM50004899
Substrate
Ki
8±n/a nM
Comments
PDSP_3929
Citation
 Shimamoto, KLebrun, BYasuda-Kamatani, YSakaitani, MShigeri, YYumoto, NNakajima, T DL-threo-beta-benzyloxyaspartate, a potent blocker of excitatory amino acid transporters. Mol Pharmacol 53:195-201 (1998)  
Target
Name:
Glutamate receptor ionotropic, NMDA 1
Synonyms:
Glutamate (NMDA) receptor subunit zeta 1 Glutamate-NMDA-Channel Glutamate-NMDA-Polyamine NMDA Nmdar1 | phencyclidine
Type:
Enzyme Catalytic Domain
Mol. Mass.:
105533.40
Organism:
RAT
Description:
P35439
Residue:
938
  
Inhibitor
Name:
BDBM50004899
Synonyms:
(1R,2S)-2-((S)-Amino-carboxy-methyl)-cyclopropanecarboxylic acid CHEMBL285369 L-CCG-IV
Type:
Small organic molecule
Emp. Form.:
C6H9NO4
Mol. Mass.:
159.14
SMILES:
N[C@@H]([C@H]1C[C@H]1C(O)=O)C(O)=O
: