Target
Glutamate receptor ionotropic, NMDA 1
Ligand
BDBM50002343
Substrate
Ki
5500±n/a nM
Comments
PDSP_1341
Citation
 Shimamoto, KLebrun, BYasuda-Kamatani, YSakaitani, MShigeri, YYumoto, NNakajima, T DL-threo-beta-benzyloxyaspartate, a potent blocker of excitatory amino acid transporters. Mol Pharmacol 53:195-201 (1998)  
Target
Name:
Glutamate receptor ionotropic, NMDA 1
Synonyms:
Glutamate (NMDA) receptor subunit zeta 1 Glutamate-NMDA-Channel Glutamate-NMDA-Polyamine NMDA Nmdar1 | phencyclidine
Type:
Enzyme Catalytic Domain
Mol. Mass.:
105533.40
Organism:
RAT
Description:
P35439
Residue:
938
  
Inhibitor
Name:
BDBM50002343
Synonyms:
2-Methylamino-succinic acid NMDA
Type:
Small organic molecule
Emp. Form.:
C5H9NO4
Mol. Mass.:
147.1293
SMILES:
CNC(CC(O)=O)C(O)=O
: