Target
Muscarinic acetylcholine receptor M2
Ligand
BDBM50001885
Substrate
Ki
>10000±n/a nM
Comments
PDSP_1599
Citation
 Bymaster, FPFelder, CCTzavara, ENomikos, GGCalligaro, DOMckinzie, DL Muscarinic mechanisms of antipsychotic atypicality. Prog Neuropsychopharmacol Biol Psychiatry 27:1125-43 (2003)  
Target
Name:
Muscarinic acetylcholine receptor M2
Synonyms:
ACM2_HUMAN Cholinergic, muscarinic M2 Muscarinic acetylcholine receptor M2 and M5 | RecName: Full=Muscarinic acetylcholine receptor M2
Type:
GPCR
Mol. Mass.:
51730.61
Organism:
Homo sapiens (Human)
Description:
P08172
Residue:
466
  
Inhibitor
Name:
BDBM50001885
Synonyms:
(risperidone)3-{2-[4-(6-Fluoro-benzo[d]isoxazol-3-yl)-piperidin-1-yl]-ethyl}-2-methyl-6,7,8,9-tetrahydro-pyrido[1,2-a]pyrimidin-4-one 2-(2-(4-(benzo[d]isoxazol-3-yl)piperidin-1-yl)ethyl)-7,8,9,9a-tetrahydro-1H-pyrido[1,2-a]pyrimidin-4(6H)-one 3-(2-(4-(6-fluorobenzo[d]isoxazol-3-yl)piperidin-1-yl)ethyl)-2-methyl-6,7,8,9-tetrahydropyrido[1,2-a]pyrimidin-4-one 3-{2-[4-(6-Fluoro-benzo[d]isoxazol-3-yl)-piperidin-1-yl]-ethyl}-2-methyl-6,7,8,9-tetrahydro-pyrido[1,2-a]pyrimidin-4-one (Resperidone) 3-{2-[4-(6-Fluoro-benzo[d]isoxazol-3-yl)-piperidin-1-yl]-ethyl}-2-methyl-6,7,8,9-tetrahydro-pyrido[1,2-a]pyrimidin-4-one(risperidone) CHEMBL85 RISPERDAL US10167256, Risperidone US10259786, Risperidone US8802672, Risperidone | WO2023288027, Cmpd Risperidone
Type:
Small organic molecule
Emp. Form.:
C23H27FN4O2
Mol. Mass.:
410.4845
SMILES:
Cc1nc2CCCCn2c(=O)c1CCN1CCC(CC1)c1noc2cc(F)ccc12
: