Target
Neuronal acetylcholine receptor subunit alpha-4
Ligand
BDBM86829
Substrate
Ki
1995±n/a nM
Comments
PDSP_8354
Citation
 Stoit, ARden Hartog, APMons, Hvan Schaik, SBarkhuijsen, NStroomer, CCoolen, HKReinders, JHAdolfs, TJvan der Neut, MKeizer, HKruse, CG 7-Azaindole derivatives as potential partial nicotinic agonists. Bioorg Med Chem Lett 18:188-93 (2008)  
Target
Name:
Neuronal acetylcholine receptor subunit alpha-4
Synonyms:
ACHA4_RAT Cholinergic, Nicotinic Alpha4Beta2 Chrna4 Neuronal acetylcholine receptor (alpha4beta2 nAChR) Neuronal acetylcholine receptor subunit alpha 4 beta 2 | Neuronal acetylcholine receptor subunit alpha-4
Type:
Enzyme
Mol. Mass.:
70196.44
Organism:
Rattus norvegicus (Rat)
Description:
P09483
Residue:
630
  
Inhibitor
Name:
BDBM86829
Synonyms:
(+/-)-2-(piperidin-3-yl)-1H-pyrrolo[2,3-b]pyridine CAS_24759729 | NSC_24759729
Type:
Small organic molecule
Emp. Form.:
C12H15N3
Mol. Mass.:
201.2676
SMILES:
C1CNCC(C1)c1cc2cccnc2[nH]1
: