Target
Neuronal acetylcholine receptor subunit alpha-4
Ligand
BDBM86836
Substrate
Ki
3715±n/a nM
Comments
PDSP_8349
Citation
 Stoit, ARden Hartog, APMons, Hvan Schaik, SBarkhuijsen, NStroomer, CCoolen, HKReinders, JHAdolfs, TJvan der Neut, MKeizer, HKruse, CG 7-Azaindole derivatives as potential partial nicotinic agonists. Bioorg Med Chem Lett 18:188-93 (2008)  
Target
Name:
Neuronal acetylcholine receptor subunit alpha-4
Synonyms:
ACHA4_RAT Cholinergic, Nicotinic Alpha4Beta2 Chrna4 Neuronal acetylcholine receptor (alpha4beta2 nAChR) Neuronal acetylcholine receptor subunit alpha 4 beta 2 | Neuronal acetylcholine receptor subunit alpha-4
Type:
Enzyme
Mol. Mass.:
70196.44
Organism:
Rattus norvegicus (Rat)
Description:
P09483
Residue:
630
  
Inhibitor
Name:
BDBM86836
Synonyms:
(R)-6-chloro-2-(pyrrolidin-2-ylmethyl)-1H-pyrrolo[2,3-b]pyridine CAS_24758166 NSC_24758166 | NSC_24758290
Type:
Small organic molecule
Emp. Form.:
C12H14ClN3
Mol. Mass.:
235.713
SMILES:
Clc1ccc2cc(CC3CCCN3)[nH]c2n1
: