Target
Neuronal acetylcholine receptor subunit alpha-4
Ligand
BDBM86831
Substrate
Ki
251±n/a nM
Comments
PDSP_8344
Citation
 Stoit, ARden Hartog, APMons, Hvan Schaik, SBarkhuijsen, NStroomer, CCoolen, HKReinders, JHAdolfs, TJvan der Neut, MKeizer, HKruse, CG 7-Azaindole derivatives as potential partial nicotinic agonists. Bioorg Med Chem Lett 18:188-93 (2008)  
Target
Name:
Neuronal acetylcholine receptor subunit alpha-4
Synonyms:
ACHA4_RAT Cholinergic, Nicotinic Alpha4Beta2 Chrna4 Neuronal acetylcholine receptor (alpha4beta2 nAChR) Neuronal acetylcholine receptor subunit alpha 4 beta 2 | Neuronal acetylcholine receptor subunit alpha-4
Type:
Enzyme
Mol. Mass.:
70196.44
Organism:
Rattus norvegicus (Rat)
Description:
P09483
Residue:
630
  
Inhibitor
Name:
BDBM86831
Synonyms:
(+/-)-2-(pyrrolidin-3-yl)-1H-pyrrolo[2,3-b]pyridine CAS_24759727 | NSC_24759727
Type:
Small organic molecule
Emp. Form.:
C11H13N3
Mol. Mass.:
187.241
SMILES:
C1CC(CN1)c1cc2cccnc2[nH]1
: