Target
Neuronal acetylcholine receptor subunit alpha-4
Ligand
BDBM86833
Substrate
Ki
26±n/a nM
Comments
PDSP_8359
Citation
 Stoit, ARden Hartog, APMons, Hvan Schaik, SBarkhuijsen, NStroomer, CCoolen, HKReinders, JHAdolfs, TJvan der Neut, MKeizer, HKruse, CG 7-Azaindole derivatives as potential partial nicotinic agonists. Bioorg Med Chem Lett 18:188-93 (2008)  
Target
Name:
Neuronal acetylcholine receptor subunit alpha-4
Synonyms:
ACHA4_RAT Cholinergic, Nicotinic Alpha4Beta2 Chrna4 Neuronal acetylcholine receptor (alpha4beta2 nAChR) Neuronal acetylcholine receptor subunit alpha 4 beta 2 | Neuronal acetylcholine receptor subunit alpha-4
Type:
Enzyme
Mol. Mass.:
70196.44
Organism:
Rattus norvegicus (Rat)
Description:
P09483
Residue:
630
  
Inhibitor
Name:
BDBM86833
Synonyms:
CAS_5310967 NSC_5310967
Type:
Small organic molecule
Emp. Form.:
C10H14N2
Mol. Mass.:
162.2316
SMILES:
CNCCC=Cc1cccnc1
: