Target
Trypanothione synthetase
Ligand
BDBM92592
Substrate
Meas. Tech.
Enzyme Assay
pH
8±0
Temperature
298.15±0 K
IC50
95±n/a nM
Citation
 Torrie, LSWyllie, SSpinks, DOza, SLThompson, SHarrison, JRGilbert, IHWyatt, PGFairlamb, AHFrearson, JA Chemical validation of trypanothione synthetase: a potential drug target for human trypanosomiasis. J Biol Chem 284:36137-45 (2009)  
Target
Name:
Trypanothione synthetase
Synonyms:
TRS TryS | Trypanothione synthetase (TryS)
Type:
Enzyme
Mol. Mass.:
73442.57
Organism:
Trypanosoma cruzi
Description:
Q9GT49
Residue:
647
  
Inhibitor
Name:
BDBM92592
Synonyms:
DDD85811
Type:
Small organic molecule
Emp. Form.:
C19H19FN2O
Mol. Mass.:
310.3654
SMILES:
CC(C)(C)C(=O)Cn1nc(-c2cccc(F)c2)c2ccccc12
: