Target
Ectonucleotide pyrophosphatase/phosphodiesterase family member 2
Ligand
BDBM103902
Substrate
Meas. Tech.
ATX Inhibitory Selectivity Test
IC50
57±0.0 nM
Citation
 Kawaguchi, MOkabe, TOkudaira, SNishimasu, HIshitani, RKojima, HNureki, OAoki, JNagano, T Screening and X-ray crystal structure-based optimization of autotaxin (ENPP2) inhibitors, using a newly developed fluorescence probe. ACS Chem Biol 8:1713-21 (2013)  
Target
Name:
Ectonucleotide pyrophosphatase/phosphodiesterase family member 2
Synonyms:
Autotaxin ENPP2_MOUSE Ectonucleotide pyrophosphatase/phosphodiesterase family member 2 Npps2 | Pdnp2
Type:
PROTEIN
Mol. Mass.:
98896.47
Organism:
Mus musculus
Description:
Residue:
862
  
Inhibitor
Name:
BDBM103902
Synonyms:
Disubstituted aryl-Me ATX inhibitor 9 | US8563583, A-6
Type:
Small organic molecule
Emp. Form.:
C22H24N2O5
Mol. Mass.:
396.4364
SMILES:
COc1cc(ccc1OCC(C)(C)O)-n1ccc(COc2ccccn2)cc1=O
: