Target
MDRC4
Ligand
BDBM8125
Substrate
Meas. Tech.
Drug Susceptibility Assay
EC50
0.6±0.0 nM
Citation
 Shen, YAltman, MDAli, ANalam, MNCao, HRana, TMSchiffer, CATidor, B Testing the substrate-envelope hypothesis with designed pairs of compounds. ACS Chem Biol 8:2433-41 (2013)  
Target
Name:
MDRC4
Synonyms:
Multi-drug-resistant control strain R268 gag-pol
Type:
Protein
Mol. Mass.:
45906.94
Organism:
Human immunodeficiency virus
Description:
P12497[489-892,L499I,G505E,R530K,M535I,I543V,L552T,T563S,V571A,I582L,V623I,A650V,S656G,V663I,F665L,R671K,K689E,Q690K,Y703F,F704Y,D711E,Q739M,C750S,D765E,I766L,K761R,G784E,R799G,F802L,V833E,A860P,R865K,K869R,V880I]
Residue:
403
  
Inhibitor
Name:
BDBM8125
Synonyms:
(3R,3aS,6aR)-hexahydrofuro[2,3-b]furan-3-yl N-[(2S,3R)-4-[(4-aminobenzene)(2-methylpropyl)sulfonamido]-3-hydroxy-1-phenylbutan-2-yl]carbamate Darunavir TMC-114 US10806794, Compound Darunavir
Type:
Small organic molecule
Emp. Form.:
C27H37N3O7S
Mol. Mass.:
547.664
SMILES:
[H][C@@]1(CO[C@@]2([H])OCC[C@@]12[H])OC(=O)N[C@@H](Cc1ccccc1)[C@H](O)CN(CC(C)C)S(=O)(=O)c1ccc(N)cc1
: