Target
Metabotropic glutamate receptor 5
Ligand
BDBM104727
Substrate
Meas. Tech.
Cell Based Assay
IC50
101±0 nM
Citation
 Conn, PJLindsley, CWEmmitte, KAWeaver, CDRodriguez, ALFelts, ASJones, CKBates, BS Substituted heteroarylamine carboxamide analogs as mGluR5 negative allosteric modulators and methods of making and using the same US Patent  US8569308 Publication Date 10/29/2013 
Target
Name:
Metabotropic glutamate receptor 5
Synonyms:
GPRC1E GRM5_HUMAN metabotropic glutamate 5 | metabotropic glutamate 5a
Type:
Enzyme
Mol. Mass.:
132484.72
Organism:
Homo sapiens (Human)
Description:
Residue:
1212
  
Inhibitor
Name:
BDBM104727
Synonyms:
US8569308, 147 | US8569308, 221
Type:
Small organic molecule
Emp. Form.:
C15H10ClN5O2
Mol. Mass.:
327.725
SMILES:
Clc1cccc(c1)C(=O)Nc1cncc(Oc2cncnc2)n1
: