Target
Metabotropic glutamate receptor 5
Ligand
BDBM104793
Substrate
Meas. Tech.
Cell Based Assay
IC50
260±0 nM
Citation
 Conn, PJLindsley, CWEmmitte, KAWeaver, CDRodriguez, ALFelts, ASJones, CKBates, BS Substituted heteroarylamine carboxamide analogs as mGluR5 negative allosteric modulators and methods of making and using the same US Patent  US8569308 Publication Date 10/29/2013 
Target
Name:
Metabotropic glutamate receptor 5
Synonyms:
GPRC1E GRM5_HUMAN metabotropic glutamate 5 | metabotropic glutamate 5a
Type:
Enzyme
Mol. Mass.:
132484.72
Organism:
Homo sapiens (Human)
Description:
Residue:
1212
  
Inhibitor
Name:
BDBM104793
Synonyms:
US8569308, 213
Type:
Small organic molecule
Emp. Form.:
C18H16ClN5O
Mol. Mass.:
353.806
SMILES:
CCN(c1cncnc1)c1cncc(NC(=O)c2cccc(Cl)c2)c1
: