Target
Metabotropic glutamate receptor 5
Ligand
BDBM104797
Substrate
Meas. Tech.
Cell Based Assay
IC50
543±0 nM
Citation
 Conn, PJLindsley, CWEmmitte, KAWeaver, CDRodriguez, ALFelts, ASJones, CKBates, BS Substituted heteroarylamine carboxamide analogs as mGluR5 negative allosteric modulators and methods of making and using the same US Patent  US8569308 Publication Date 10/29/2013 
Target
Name:
Metabotropic glutamate receptor 5
Synonyms:
GPRC1E GRM5_HUMAN metabotropic glutamate 5 | metabotropic glutamate 5a
Type:
Enzyme
Mol. Mass.:
132484.72
Organism:
Homo sapiens (Human)
Description:
Residue:
1212
  
Inhibitor
Name:
BDBM104797
Synonyms:
US8569308, 217 | US8569308, 231
Type:
Small organic molecule
Emp. Form.:
C17H14ClN5O
Mol. Mass.:
339.779
SMILES:
CN(c1cncnc1)c1cc(NC(=O)c2cccc(Cl)c2)ccn1
: