Target
Metabotropic glutamate receptor 5
Ligand
BDBM104795
Substrate
Meas. Tech.
Cell Based Assay
IC50
146±30 nM
Citation
 Conn, PJLindsley, CWEmmitte, KAWeaver, CDRodriguez, ALFelts, ASJones, CKBates, BS Substituted heteroarylamine carboxamide analogs as mGluR5 negative allosteric modulators and methods of making and using the same US Patent  US8569308 Publication Date 10/29/2013 
Target
Name:
Metabotropic glutamate receptor 5
Synonyms:
GRM5_RAT Grm5 Mglur5 metabotropic glutamate 5/1-C metabotropic glutamate 5a
Type:
Enzyme
Mol. Mass.:
131900.14
Organism:
Rattus norvegicus (Rat)
Description:
P31424
Residue:
1203
  
Inhibitor
Name:
BDBM104795
Synonyms:
US8569308, 215 | US8569308, 230
Type:
Small organic molecule
Emp. Form.:
C17H14BrN5O
Mol. Mass.:
384.23
SMILES:
CN(c1cncnc1)c1cncc(NC(=O)c2cccc(Br)c2)c1
: